{"text_format":"1","workbook":"xlsx","n_sheets":8,"sheets":["Serviceability","HEM","Tables","Serviceability Calc","Tax Calc","User Problems","Version Control","Day and Months Table"],"not_rendered":{"charts":0,"images":1,"macros":1,"external_links":1,"defined_names":7,"comments":0,"pivot_tables":0},"unopened":[],"bounds":{"document_bytes":16777216,"sheet_cells":100000,"rows_first":2000,"rows_last":500,"rows_between":2000,"halvings":0,"cell_chars":16384,"cell_head_chars":4096},"cells_cut":0,"cells_raw":0,"read":"whole","date_system":"1900"}

{"sheet":"Serviceability","index":0,"n_rows":91,"n_cols":13,"rows_kept":91,"cut":false,"hidden":false,"merged":[[17,6,17,8],[73,8,74,10],[73,11,74,11],[58,6,58,7],[59,6,59,7],[60,6,60,7],[61,6,61,7],[58,8,58,9],[59,8,59,9],[60,8,60,9],[61,8,61,9],[85,3,86,11],[73,3,74,7],[40,7,40,12],[42,7,42,12],[30,3,30,11],[79,11,81,11],[57,8,57,9],[57,6,57,7],[64,6,64,7],[82,7,82,8]]}
[]
[]
[null,null,"Serviceability Calculator (Residential)"]
[null,null,null,"RedZed Lending Solutions Pty Ltd (ACL 311128)"]
[]
[null,null,null,"Information can be entered in the clear boxes, the grey boxes contain RedZed calculations."]
[]
[null,null,null,"Application name - mandatory"]
[]
[null,null,null,"Income Table",null,null,"Gross Annual",null,null,null,null,"Net Monthly"]
[]
[null,null,null,"Personal Income",null,"Select Household"]
[null,null,null,"Applicant / Guarantor 1","PAYG/Self Employed - Alt Doc Declaration/Self Employed - Full Doc",null,null," ",null,null,null,{"$f":"'Tax Calc'!I5","v":0}]
[null,null,null,"Applicant / Guarantor 2","PAYG/Self Employed - Alt Doc Declaration/Self Employed - Full Doc",null,null,null,null,null,null,{"$f":"'Tax Calc'!I6","v":0}]
[null,null,null,"Applicant / Guarantor 3","PAYG/Self Employed - Alt Doc Declaration/Self Employed - Full Doc",null,null,null,null,null,null,{"$f":"'Tax Calc'!I7","v":0}]
{"$rows_left_out":77}
{"sheet":"HEM","index":1,"n_rows":46,"n_cols":15,"rows_kept":46,"cut":false,"hidden":true,"merged":[[18,3,18,4]]}
["Income Range ($)","Single Adult","Single Adult +1","Single Adult +2","Single Adult +3","Single Adult +4","Single Adult +5","Single Adult +6","Couple","Couple +1","Couple +2","Couple +3","Couple +4","Couple +5","Couple +6"]
["0 - 23,000",1130.9647922804736,1611.7175919915917,2050.2008055077345,2623.6634955772988,2973.608268818597,3634.3037253191351,4293.5862337337994,2248.7389380243421,2651.9868291604157,2944.7970084478061,3285.4778576361859,3819.3701180140611,4138.4827082735283,4457.595298532995]
["23,001 - 34,000",1204.9654499764481,1611.7175919915917,2050.2008055077345,2623.6634955772988,2973.608268818597,3634.3037253191351,4293.5862337337994,2248.7389380243421,2651.9868291604157,2944.7970084478061,3285.4778576361859,3819.3701180140611,4138.4827082735283,4457.595298532995]
["34,001 - 46,000",1264.4432284896761,1670.7438712326432,2109.4426587720418,2623.6634955772988,2973.608268818597,3634.3037253191351,4293.5862337337994,2308.4616302262525,2651.9868291604157,2944.7970084478061,3285.4778576361859,3819.3701180140611,4138.4827082735283,4457.595298532995]
["46,001 - 57,000",1350.5065669132434,1756.1536566318066,2195.1644236723591,2712.1377924992494,3059.644024637852,3634.3037253191351,4293.5862337337994,2394.879159355623,2738.0782451615191,3031.0727677273803,3285.4778576361859,3819.3701180140611,4138.4827082735283,4457.595298532995]
["57,001 - 69,000",1497.9401503130018,1902.4679370709298,2342.0131178294791,2863.7017737755414,3207.0310103179081,3634.3037253191351,4293.5862337337994,2542.9197569761932,2885.5601831804192,3178.8705015042374,3433.0856739066517,3819.3701180140611,4138.4827082735283,4457.595298532995]
["69,001 - 92,000",1730.0608231939257,2132.8261442858015,2573.2127096694153,3102.3251460148745,3439.0777635538416,3866.331998643821,4293.5862337337994,2775.995889808501,3117.7567187555301,3411.5644271607266,3665.4808026752439,4050.715981246798,4369.3960041063729,4688.0760269659468]
["92,001 - 115,000",2056.2118763305302,2456.500864692955,2898.0696537818362,3437.6131925142727,3765.1251863074085,4192.3535138016277,4619.581841295847,3103.4895486635069,3444.0143584622529,3738.5206661671614,3992.0172606326082,4375.7779120505384,4693.8500028972958,5011.9220937440541]
["115,001 - 138,000",2347.8339691520782,2745.9087539259326,3188.5344090506655,3737.4045184795673,4056.6542195951597,4483.85928220593,4911.0643448167002,3396.3118730602218,3735.7320590949935,4030.862609125466,4283.984261845847,4666.4270068325804,4983.9557902756696,5301.4845737187588]
["138,001 - 161,000",2707.8408575255512,3103.1822124126843,3547.1130482742115,4107.4973031850959,4416.5469892784113,4843.7235222166255,5270.9000551548406,3757.8009305511059,4095.8567297847053,4391.7587952243211,4644.4166933922379,5025.2320227963291,5342.0897958576352,5658.9475689189412]
["161,001 - 184,000",2838.7015221859906,3233.0491315470786,3677.4543070485302,4242.0237980769225,4547.365647193993,4974.5316784459937,5401.6977096979936,3889.2001095109281,4226.7600487293876,4522.9424109523288,4775.431881700114,5155.6556837361131,5472.2695772924089,5788.8834708487047]
["184,001 - 229,000",3053.8888140934091,3446.6027252919098,3891.7878273231836,4463.2394503079931,4762.4847650510746,5189.6337527904907,5616.7827405299076,4105.2732766146864,4442.0178222762052,4738.6607866388749,4990.8736135318959,5370.1244939204853,5686.3372982469355,6002.5501025733847]
["229,001 - 287,000",3586.1384805759535,3974.811250337716,4421.9257160778407,5010.4000600961544,5294.5654770463179,5721.6722261639088,6148.7789752814997,4639.7138119564379,4974.4415437075249,5272.2248792265036,5523.7525804643237,5900.5976184747697,6215.8185701043521,6531.0395217339355]
["287,001 - 344,000",4138.7278802516548,4523.2048381780633,4972.3223145287966,5578.4698016826924,5846.9787454187554,6274.0414617105307,6701.1041780023052,5194.5778866151277,5527.2118912971928,5826.1783685618066,6076.9950047600969,6451.342266664542,6765.5333616768958,7079.7244566892496]
["344,001 - 574,000",4208.8776772260599,4592.8220077006335,5042.1937611478297,5650.5848088191115,5917.1062322924718,6344.163371059075,6771.2205098256782,5265.0164477032367,5597.3844799730732,5896.5016923000467,6147.2277217233895,6521.2578866920712,6835.3182464392794,7149.3786061864885]
{"$rows_left_out":32}
{"sheet":"Tables","index":2,"n_rows":318,"n_cols":15,"rows_kept":318,"cut":false,"hidden":true,"merged":[[68,5,68,6],[68,1,68,2],[68,7,68,8]]}
[]
["Tax"]
[null,null,null,null,null,null,"Flood Levy"]
["Wages Over","Not to Exceed","Tax Rate",null,null,null,"Taxable income","Flood levy on this income"]
[0,18200,0,null,null,null,"$0 to $50,000","Nil",0,50000,0]
[{"$f":"B5+1","v":18201},45000,0.19,{"$f":"D5+C5*(B5-A5)","v":0},null,null,"$50,001 to $100,000","Half a cent for each $1 over $50,000",50001,100000,0,{"$f":"(J6-J5)*K6","v":0}]
[{"$f":"B6+1","v":45001},120000,0.32500000000000001,{"$f":"ROUNDUP(D6+C6*(B6-A6),0)","v":5092},null,null,"Over $100,000","$250 plus 1c for each $1 over $100,000",{"$f":"J6+1","v":100001},null,0]
[{"$f":"B7+1","v":120001},180000,0.37,{"$f":"ROUNDUP(D7+C7*(B7-A7),0)","v":29467}]
[{"$f":"B8+1","v":180001},null,0.45,{"$f":"ROUNDUP(D8+C8*(B8-A8),0)","v":51667}]
[null,null,null,null,null,null,"                        "]
[null,null,null,null,null,null,"   "]
["Medicare Levy"]
[null,null,null,null,null,null,"Taxable income","Tax on this income"]
[0,16284,0,null,"not currently used",null,"0 - $18,200","Nil"]
[16284,17604,0.2,null,null,null,"$18,201 - $37,000","19c for each $1 over $18,200"]
{"$rows_left_out":304}
{"sheet":"Serviceability Calc","index":3,"n_rows":19,"n_cols":3,"rows_kept":19,"cut":false,"hidden":true,"merged":[[0,0,0,1]]}
["Serviceability Cell Calculation"]
[]
[null,{"$f":"Serviceability!D49&\" (After Tax Rates Applied)\"","v":"Available Income (After Tax Rates Applied)"},{"$f":"Serviceability!L49","v":0}]
[null,"Divided by"]
[null,{"$f":"Serviceability!D71","v":"Total Monthly Commitments"},{"$f":"SUM(Serviceability!L55:L70)","v":0}]
["Less",{"$f":"Serviceability!$D$53&\" - \"&Serviceability!E55","v":"RedZed Loan Applied For - Loan 1"},{"$f":"-Serviceability!L55","v":0}]
["Less",{"$f":"Serviceability!$D$53&\" - \"&Serviceability!E56","v":"RedZed Loan Applied For - Loan 2"},{"$f":"-Serviceability!L56","v":0}]
["Plus",{"$f":"Serviceability!$D$53&\" - \"&Tables!A32","v":"RedZed Loan Applied For - Buffered Loan 1"},{"$f":"Tables!B32","v":0}]
["Plus",{"$f":"Serviceability!$D$53&\" - \"&Tables!A33","v":"RedZed Loan Applied For - Buffered Loan 2"},{"$f":"Tables!B33","v":0}]
["Less",{"$f":"Serviceability!$D$59&\": \"&Serviceability!E59","v":"Existing Loans: Loan 1 - Existing Secured"},{"$f":"-Serviceability!L59","v":0}]
["Less",{"$f":"Serviceability!$D$59&\": \"&Serviceability!E60","v":"Existing Loans: Loan 2 - Existing Secured"},{"$f":"-Serviceability!L60","v":0}]
["Plus",{"$f":"Serviceability!$D$59&\": \"&Tables!A37","v":"Existing Loans: Buffered Loan 1"},{"$f":"Tables!C37","v":0}]
["Plus",{"$f":"Serviceability!$D$59&\": \"&Tables!A38","v":"Existing Loans: Buffered Loan 2"},{"$f":"Tables!C38","v":0}]
["Plus",{"$f":"Tables!A42","v":"Fees - Loan 1"},{"$f":"Tables!C42","v":0}]
["Plus",{"$f":"Tables!A43","v":"Fees - Loan 2"},{"$f":"Tables!C43","v":0}]
{"$rows_left_out":5}
{"sheet":"Tax Calc","index":4,"n_rows":51,"n_cols":11,"rows_kept":51,"cut":false,"hidden":true,"merged":[]}
["Tax Calc"]
[]
["Annual Gross",null,null,"Gross","Tax","Medicare","Income offset","Net","Net Monthly"]
[]
["Applicant / G'Tor 1","Salary / Self Employed",null,{"$f":"Serviceability!G13","v":0},{"$f":"IF(D5<Tables!$A$6,0,IF(AND(D5>Tables!$A$6,D5<Tables!$A$7),(D5-Tables!$A$6)*Tables!$C$6,IF(AND(D5>Tables!$A$7,D5<Tables!$A$8),Tables!$D$7+(D5-Tables!$A$7)*Tables!$C$7,IF(AND(D5>Tables!$A$8,D5<Tables!$A$9),Tables!$D$8+(D5-Tables!$A$8)*Tables!$C$8,IF(D5>Tables!$A$9,Tables!$D$9+(D5-Tables!$A$9)*Tables!$C$9)))))","v":0},{"$f":"D5*Tables!C$16","v":0},{"$f":"IFERROR(((D5-VLOOKUP(D5,$A$29:$D$33,1,TRUE))*VLOOKUP(D5,$A$29:$D$33,3,TRUE)+VLOOKUP(D5,$A$29:$D$33,4,TRUE)),0)+IFERROR((IF(D5>66667,66667-45001,(D5-VLOOKUP(D5,$A$41:$D$43,1,TRUE)))*VLOOKUP(D5,$A$41:$D$43,3,TRUE)+VLOOKUP(D5,$A$41:$D$43,4,TRUE)),0)","v":0},{"$f":"D5-E5-F5+G5","v":0},{"$f":"H5/12","v":0}]
["Applicant / G'Tor 2","Salary / Self Employed",null,{"$f":"Serviceability!G14","v":0},{"$f":"IF(D6<Tables!$A$6,0,IF(AND(D6>=Tables!$A$6,D6<Tables!$A$7),(D6-Tables!$A$6)*Tables!$C$6,IF(AND(D6>=Tables!$A$7,D6<Tables!$A$8),Tables!$D$7+(D6-Tables!$A$7)*Tables!$C$7,IF(AND(D6>=Tables!$A$8,D6<Tables!$A$9),Tables!$D$8+(D6-Tables!$A$8)*Tables!$C$8,IF(D6>=Tables!$A$9,Tables!$D$9+(D6-Tables!$A$9)*Tables!$C$9)))))","v":0},{"$f":"D6*Tables!C$16","v":0},{"$f":"IFERROR(((D6-VLOOKUP(D6,$A$29:$D$33,1,TRUE))*VLOOKUP(D6,$A$29:$D$33,3,TRUE)+VLOOKUP(D6,$A$29:$D$33,4,TRUE)),0)+IFERROR((IF(D6>66667,66667-45001,(D6-VLOOKUP(D6,$A$41:$D$43,1,TRUE)))*VLOOKUP(D6,$A$41:$D$43,3,TRUE)+VLOOKUP(D6,$A$41:$D$43,4,TRUE)),0)","v":0},{"$f":"D6-E6-F6+G6","v":0},{"$f":"H6/12","v":0}]
["Applicant / G'Tor 3","Salary / Self Employed",null,{"$f":"Serviceability!G15","v":0},{"$f":"IF(D7<Tables!$A$6,0,IF(AND(D7>=Tables!$A$6,D7<Tables!$A$7),(D7-Tables!$A$6)*Tables!$C$6,IF(AND(D7>=Tables!$A$7,D7<Tables!$A$8),Tables!$D$7+(D7-Tables!$A$7)*Tables!$C$7,IF(AND(D7>=Tables!$A$8,D7<Tables!$A$9),Tables!$D$8+(D7-Tables!$A$8)*Tables!$C$8,IF(D7>=Tables!$A$9,Tables!$D$9+(D7-Tables!$A$9)*Tables!$C$9)))))","v":0},{"$f":"D7*Tables!C$16","v":0},0,0,{"$f":"H7/12","v":0}]
["Applicant / G'Tor 4","Salary / Self Employed",null,{"$f":"Serviceability!G16","v":0},{"$f":"IF(D8<Tables!$A$6,0,IF(AND(D8>=Tables!$A$6,D8<Tables!$A$7),(D8-Tables!$A$6)*Tables!$C$6,IF(AND(D8>=Tables!$A$7,D8<Tables!$A$8),Tables!$D$7+(D8-Tables!$A$7)*Tables!$C$7,IF(AND(D8>=Tables!$A$8,D8<Tables!$A$9),Tables!$D$8+(D8-Tables!$A$8)*Tables!$C$8,IF(D8>=Tables!$A$9,Tables!$D$9+(D8-Tables!$A$9)*Tables!$C$9)))))","v":0},{"$f":"D8*Tables!C$16","v":0},0,0,{"$f":"H8/12","v":0}]
[]
[]
[]
[]
[]
[]
[]
{"$rows_left_out":37}
{"sheet":"User Problems","index":5,"n_rows":34,"n_cols":17,"rows_kept":34,"cut":false,"hidden":true,"merged":[]}
["#","Date","Submitted By","Sheet Name (if applicable)","Problem","Initial Review Assessment","Review Result Date","Review With User","Review Result or Action to Take","Sheets Affected","Development Version #","Type","Estimate (hrs)","Actual","Status","Date Unit Tested","Release Version #"]
[1,"2017-04-06","Bill Slattery",null,"What we are trying to achieve is a stress test of servicing capacity at the higher of;\n1. The selected interest rate + 2% or \n2. 7% \nThis change should only apply to Residential loans.\n",null,null,null,null,null,{"$f":"'Version Control'!C2","v":"V6.4 Test"},"Enhancement",null,null,"Completed","2017-04-10",{"$f":"'Version Control'!$C$9","v":"v6.5"}]
[2,"2017-04-10","Trevor Smith",null,"The tax table in the Residential calculator is not the same as in the Consolidated Calculator. Looks like the Residential Calculator was not updated for the 2017/2018 change to the upper limit for the 32.5% rate (ie from $80000 to $87000).","Change the tax table in the Residential Calculator in expectation you want it to match that in the Consolidated Calculator.","2017-04-10","Bill Slattery","Change as recommended",null,{"$f":"'Version Control'!C3","v":"V6.4 Test2  (v6.42)"},"Bug",null,null,"Completed","2017-04-10",{"$f":"'Version Control'!$C$9","v":"v6.5"}]
[3,"2017-04-24","Bill Slattery","Serviceability Calc","Add Serviceabilty Calculation Sheet as per Consolidated User Problem #131.","Name as \"Serviceability Calc\"",null,null,null,null,{"$f":"'Version Control'!$C$4","v":"V6.6 Test (v6.43)"},"Enhancement",null,null,"Completed","2017-05-01",{"$f":"'Version Control'!$C$9","v":"v6.5"}]
[4,"2017-04-24","Mario Lorenzi",null,"Add two macros:\n-Ctl/Shift/B to unhide the calculation sheets\n-Ctl/Shift/H to hide the calculation sheets\n",null,null,null,null,null,{"$f":"'Version Control'!$C$4","v":"V6.6 Test (v6.43)"},"Enhancement",null,null,"Completed","2017-05-01",{"$f":"'Version Control'!$C$9","v":"v6.5"}]
[5,"2017-04-24","Mario Lorenzi","Tables","Change Company Tax Rate to 28.5%","Set up a  a new Company Tax Table on Tables sheet. Change Company Income Calculation (Cell K18) to reference the new Company Tax Table.",null,null,null,null,{"$f":"'Version Control'!$C$4","v":"V6.6 Test (v6.43)"},"Data Maintenance",null,null,"Completed","2017-05-01",{"$f":"'Version Control'!$C$9","v":"v6.5"}]
[6,"2017-04-24","Mario Lorenzi","Serviceability","Add Interest Only Term cells for RedZed Loans 1 and 2 on Serviceability sheet.\nChange the Rate buffering calculation to use the net term (Total Term less Interest Only Term)",null,null,null,null,null,{"$f":"'Version Control'!$C$4","v":"V6.6 Test (v6.43)"},"Enhancement",null,null,"Completed","2017-05-01",{"$f":"'Version Control'!$C$9","v":"v6.5"}]
[7,"2017-04-24","Mario Lorenzi","Serviceability","Add Source of Other Incomes cell for each of the Other Regular Monthly Income lines on the Serviceability sheets.",null,null,null,null,null,{"$f":"'Version Control'!$C$4","v":"V6.6 Test (v6.43)"},"Enhancement",null,null,"Completed","2017-05-01",{"$f":"'Version Control'!$C$9","v":"v6.5"}]
[8,"2017-04-24","Mario Lorenzi","Serviceability","Change Company Income heading to display \"Company Income (if applicable)\"",null,null,null,null,null,{"$f":"'Version Control'!$C$4","v":"V6.6 Test (v6.43)"},"Enhancement",null,null,"Completed","2017-05-01",{"$f":"'Version Control'!$C$9","v":"v6.5"}]
[9,"2017-04-24","Mario Lorenzi","Serviceability","Swap columns displaying Existing & New v Rental Income/Rental Income ",null,null,null,null,null,{"$f":"'Version Control'!$C$4","v":"V6.6 Test (v6.43)"},"Enhancement",null,null,"Completed","2017-05-01",{"$f":"'Version Control'!$C$9","v":"v6.5"}]
[10,"2017-04-24","Mario Lorenzi","Tables","Check Monthly Service Fee calculation - to assume entry of Residential Loans only - calculated at $15 per month",null,null,null,null,null,{"$f":"'Version Control'!$C$4","v":"V6.6 Test (v6.43)"},"Bug",null,null,"Completed","2017-05-01",{"$f":"'Version Control'!$C$9","v":"v6.5"}]
[11,"2017-04-24","Mario Lorenzi","Serviceability","Company Income headings realigned to display above the detail line",null,null,null,null,null,{"$f":"'Version Control'!$C$4","v":"V6.6 Test (v6.43)"},"Enhancement",null,null,"Completed","2017-05-01",{"$f":"'Version Control'!$C$9","v":"v6.5"}]
[12,"2017-04-24","Mario Lorenzi","Serviceability","Company Income section moved to display after Rental Income",null,null,null,null,null,{"$f":"'Version Control'!$C$4","v":"V6.6 Test (v6.43)"},"Enhancement",null,null,"Completed","2017-05-01",{"$f":"'Version Control'!$C$9","v":"v6.5"}]
[13,"2017-04-24","Mario Lorenzi","Serviceability","Change Personal Income descriptors from \"Guarantor 1, 2, 3, and 4\" to \"Applicant / Guarantor 1, 2, 3, and 4\"",null,null,null,null,null,{"$f":"'Version Control'!$C$4","v":"V6.6 Test (v6.43)"},"Enhancement",null,null,"Completed","2017-05-01",{"$f":"'Version Control'!$C$9","v":"v6.5"}]
[14,"2017-04-24","Mario Lorenzi","Tables","Tables Sheet - Highlight in yellow those data cells that can be changed to reflect legislation or company policy changes.",null,null,null,null,null,{"$f":"'Version Control'!$C$4","v":"V6.6 Test (v6.43)"},"Enhancement",null,null,"Completed","2017-05-01",{"$f":"'Version Control'!$C$9","v":"v6.5"}]
{"$rows_left_out":20}
{"sheet":"Version Control","index":6,"n_rows":32,"n_cols":10,"rows_kept":32,"cut":false,"hidden":true,"merged":[]}
["Name","Date","Version #","Development Version File Name","Changes","Released Version",null,"Current Version",{"$f":"VLOOKUP($J$1,B2:$I$3983,8,FALSE)","v":"V10.16 220616"},{"$f":"MAX(B2:B3983)","v":"2022-06-16"}]
["Trevor Smith","2017-04-10","V6.4 Test","K:\\IT\\Change_Work Requests\\Work Request\\WR004 - Commercial Calculator\\02 Residential Calculator\\2017 05 Changes\\4. REDZED-Serviceability-170410-V6.4 Test2.xls","User Problem 1",null,{"$f":"IFERROR(VLOOKUP(MONTH(B2),'Day and Months Table'!A:B,2,FALSE)&VLOOKUP(DAY(B2),'Day and Months Table'!A:B,2,FALSE),\"N/A\")","v":"0410"},{"$f":"RIGHT(YEAR(B2),2)&G2","v":"170410"},{"$f":"CONCATENATE(C2,\" \",H2)","v":"V6.4 Test 170410"}]
["Trevor Smith","2017-04-10","V6.4 Test2  (v6.42)","K:\\IT\\Change_Work Requests\\Work Request\\WR004 - Commercial Calculator\\02 Residential Calculator\\2017 05 Changes\\4. REDZED-Serviceability-170410-V6.4 Test.xls","User Problem 2",null,{"$f":"IFERROR(VLOOKUP(MONTH(B3),'Day and Months Table'!A:B,2,FALSE)&VLOOKUP(DAY(B3),'Day and Months Table'!A:B,2,FALSE),\"N/A\")","v":"0410"},{"$f":"RIGHT(YEAR(B3),2)&G3","v":"170410"},{"$f":"CONCATENATE(C3,\" \",H3)","v":"V6.4 Test2  (v6.42) 170410"}]
["Trevor Smith","2017-05-01","V6.6 Test (v6.43)","K:\\IT\\Change_Work Requests\\Work Request\\WR004 - Commercial Calculator\\02 Residential Calculator\\2017 05 Changes\\4. REDZED-Serviceability-170410-V6.6 Test.xls","User Problems 3 - 14 inclusive",null,{"$f":"IFERROR(VLOOKUP(MONTH(B4),'Day and Months Table'!A:B,2,FALSE)&VLOOKUP(DAY(B4),'Day and Months Table'!A:B,2,FALSE),\"N/A\")","v":"0501"},"170501","V6.6 Test (v6.43) 170501"]
["Trevor Smith","2017-05-15","V6.8 Test (v6.44)","K:\\IT\\Change_Work Requests\\Work Request\\WR004 - Commercial Calculator\\02 Residential Calculator\\2017 05 Changes\\4. REDZED-Serviceability-170410-V6.8 Test.xls","User Problems 15 - 17 inclusive",null,{"$f":"IFERROR(VLOOKUP(MONTH(B5),'Day and Months Table'!A:B,2,FALSE)&VLOOKUP(DAY(B5),'Day and Months Table'!A:B,2,FALSE),\"N/A\")","v":"0515"},"170515","V6.8 Test (v6.44) 170515"]
["Trevor Smith","2017-06-21","V6.9 (v6.45)","K:\\IT\\Change_Work Requests\\Work Request\\WR004 - Commercial Calculator\\02 Residential Calculator\\2017 05 Changes\\4. REDZED-Serviceability-170410-V6.9.xls","User Problem 18 - 19","Issued to Mario Lorenzi for testing 20 June 2017",{"$f":"IFERROR(VLOOKUP(MONTH(B6),'Day and Months Table'!A:B,2,FALSE)&VLOOKUP(DAY(B6),'Day and Months Table'!A:B,2,FALSE),\"N/A\")","v":"0621"},"170621","V6.9 (v6.45) 170621"]
["Trevor Smith","2017-06-27","V6.10 (v6.46)","K:\\IT\\Change_Work Requests\\Work Request\\WR004 - Commercial Calculator\\02 Residential Calculator\\2017 05 Changes\\4. REDZED-Serviceability-170410-V6.10.xls\nA changed versioning system for both this Residential Calculator and the Commercial Calculator was agreed with Tina Georgiadis 26 June 2015 (after receiving feedback from Angel Klidomitis). The last version of the Residential Calculator was named \"4. REDZED-Serviceability-170410-V6.4.xls\". The naming convention is being changed to \"REDZED-Serviceability Type (ie Residential or Commercial) Version Number.xls\". Each release will have a date added as a suffix in the format yymmdd. Because the upcoming release does not contain major ammendments it will be named  \"REDZED-Serviceability Residential v6.5 yymmdd.xls\". This being the case, the naming of the development files should have been as per the bracketed values in the Version # cells (eg 4. REDZED-Serviceability-170410-V6.4 Test.xls should have been 4. REDZED-Serviceability-170410-V6.41.xls)\nTo move to the new numbering system this version was copied and renamed and saved to the new development and release folder structure 26 June 2017. The new location and file name is K:\\Credit\\Servicing Calculator - Residential\\Development - Residential\\REDZED-Serviceability Residential V0.646.xlsm. The released version number for this series of amendments will be v6.5 with a date added in the format yymmdd.","A renamed version + User Problem 20",null,{"$f":"IFERROR(VLOOKUP(MONTH(B7),'Day and Months Table'!A:B,2,FALSE)&VLOOKUP(DAY(B7),'Day and Months Table'!A:B,2,FALSE),\"N/A\")","v":"0627"},"170627","V6.10 (v6.46) 170627"]
["Trevor Smith","2017-06-29","v6.47 Pending","K:\\Credit\\Servicing Calculator - Residential\\Development - Residential\\REDZED-Serviceability Residential V0.647.xlsm","User Problem 21",null,{"$f":"IFERROR(VLOOKUP(MONTH(B8),'Day and Months Table'!A:B,2,FALSE)&VLOOKUP(DAY(B8),'Day and Months Table'!A:B,2,FALSE),\"N/A\")","v":"0629"},"170629","v6.47 Pending 170629"]
["Trevor Smith","2017-06-30","v6.5",null,null,"K:\\Credit\\Servicing Calculator - Residential\\Current Released Version - Residential\\REDZED-Serviceability Residential V6.5.xlsm",{"$f":"IFERROR(VLOOKUP(MONTH(B9),'Day and Months Table'!A:B,2,FALSE)&VLOOKUP(DAY(B9),'Day and Months Table'!A:B,2,FALSE),\"N/A\")","v":"0630"},"170630","v6.5 170630"]
["Mayank Badhen","2018-06-25","V7.1A","Updated the living expense ",null,null,{"$f":"IFERROR(VLOOKUP(MONTH(B10),'Day and Months Table'!A:B,2,FALSE)&VLOOKUP(DAY(B10),'Day and Months Table'!A:B,2,FALSE),\"N/A\")","v":"0625"},"180625","V7.1A 180625"]
["Mayank Badhen","2018-07-25","V7.2","updated living expense for Company\nselecting household is mandatory\nupdated the tax scale\ncompnay income is always attached to household 1",null,null,{"$f":"IFERROR(VLOOKUP(MONTH(B11),'Day and Months Table'!A:B,2,FALSE)&VLOOKUP(DAY(B11),'Day and Months Table'!A:B,2,FALSE),\"N/A\")","v":"0725"},"180725","V7.2 180725"]
["Mayank Badhen","2018-12-11","V7.2.1","IF more then three adult in one household please display the mssage",null,null,{"$f":"IFERROR(VLOOKUP(MONTH(B12),'Day and Months Table'!A:B,2,FALSE)&VLOOKUP(DAY(B12),'Day and Months Table'!A:B,2,FALSE),\"N/A\")","v":"1211"},"181211","V7.2.1 181211"]
["Mayank Badhen","2019-06-26","V7.3","credit card obligations",null,null,{"$f":"IFERROR(VLOOKUP(MONTH(B13),'Day and Months Table'!A:B,2,FALSE)&VLOOKUP(DAY(B13),'Day and Months Table'!A:B,2,FALSE),\"N/A\")","v":"0626"},"190626","V7.3 190626"]
["Mayank Badhen","2019-12-02","V7.4","IO term fixed",null,null,{"$f":"IFERROR(VLOOKUP(MONTH(B14),'Day and Months Table'!A:B,2,FALSE)&VLOOKUP(DAY(B14),'Day and Months Table'!A:B,2,FALSE),\"N/A\")","v":"1202"},"191202","V7.4 191202"]
[null,null,null,null,null,null,{"$f":"IFERROR(VLOOKUP(MONTH(B15),'Day and Months Table'!A:B,2,FALSE)&VLOOKUP(DAY(B15),'Day and Months Table'!A:B,2,FALSE),\"N/A\")","v":"N/A"},"00N/A"," 00N/A"]
{"$rows_left_out":18}
{"sheet":"Day and Months Table","index":7,"n_rows":31,"n_cols":2,"rows_kept":31,"cut":false,"hidden":true,"merged":[]}
[1,"01"]
[2,"02"]
[3,"03"]
[4,"04"]
[5,"05"]
[6,"06"]
[7,"07"]
[8,"08"]
[9,"09"]
[10,"10"]
[11,"11"]
[12,"12"]
[13,"13"]
[14,"14"]
[15,"15"]
{"$rows_left_out":16}